{"text_format":"1","workbook":"xlsx","n_sheets":5,"sheets":["Instructions","Calculateur","Résultats","Tables de données (WEB)","Historique des calculs"],"not_rendered":{"charts":2,"images":10,"macros":1,"external_links":0,"defined_names":3,"comments":2,"pivot_tables":0},"unopened":[],"bounds":{"document_bytes":16777216,"sheet_cells":100000,"rows_first":2000,"rows_last":500,"rows_between":2000,"halvings":0,"cell_chars":16384,"cell_head_chars":4096},"cells_cut":0,"cells_raw":0,"read":"whole","date_system":"1900"}

{"sheet":"Instructions","index":0,"n_rows":0,"n_cols":0,"rows_kept":0,"cut":false,"hidden":false,"merged":[]}

{"sheet":"Calculateur","index":1,"n_rows":38,"n_cols":9,"rows_kept":38,"cut":false,"hidden":false,"merged":[[3,7,3,8],[4,1,5,5],[3,1,3,5],[1,1,1,8]]}
[]
[null,"Coût total d'importation au Québec"]
[]
[null,"Saisie des paramètres de calcul",null,null,null,null,null,"Boîte d'action"]
[null,"\n\n\n Valeur suggérée : Il s'agit de la valeur proposée, selon les données de base.\n Valeur choisie : Il est possible d'utiliser la valeur suggérée ou d'entrer une valeur correspondant à votre réalité.\n\n\nLégende: \n* Bleu = Choix     * Gris = rien à saisir     *Jaune = Valeur à saisir",null,null,null,null,null,"Dernière mise à jour des données web:","2023-11-01T11:37:03"]
[]
[null,"Paramètre de calcul","Description","Choix","Valeur sugérée","Valeur choisie"]
[null,"Nom de l'entreprise","Veuillez inscrire le nom de votre entreprise.\n"]
[null,"Pays","Veuillez choisir le pays duquel vous importez vos produits. \nLe taux de change selon la devise du pays s'affichera. \nConfirmer le taux de change dans la valeur choisie.\n",null,{"$f":"IFERROR(VLOOKUP(Calculateur!D9,'Tables de données (WEB)'!C8:E25,3,FALSE),\"\")","v":""}]
[null,"Prix unitaire","Veuillez saisir le prix unitaire du produit importé.\nPrix FOB, au point d'expédition.\nIMPORTANT: Choisir la devise pour utiliser le bon taux de change.",null,{"$f":"IF(D10=\"\", \"\",IF(D10=\"Dollars Américains\",'Tables de données (WEB)'!E24,Calculateur!F9))","v":""}]
[null,"Quantité annuelle","Veuillez saisir la quantité commandée annuellement.\nEntrez la plus petite valeur entre la quantité économique à commander (QEC) ou la quantité minimale de commande.\n"]
[null,"Catégorie de produit","Veuillez choisir la catégorie de votre produit.\n",null,null,{"$f":"IF(ISBLANK(D12)=TRUE,\"\",D12)","v":""}]
[null,"Poids du produit ","Veuillez entrer le poids du produit importé, en kg.\n"]
[null,"Frais de transport","Pour évaluer le coût de transport, indiquez le type de conteneur utilisé pour le transport de votre marchandise.\nNote: Le prix unitaire étant FOB, les frais de transport sont calculés à partir du port d'embarquement.\n",null,{"$f":"IF(D14=\"\",\"\",E38*1000)","v":""}]
[null,"Frais de fret ","Veuillez saisir le montant des frais de chargement et de déchargement aux ports de destination et d'arrivée. \n ",{"$f":"IF(D14=0,\"\",D14)","v":""},{"$f":"IFERROR(HLOOKUP(D15,'Tables de données (WEB)'!L24:M25,2,FALSE),\"\")","v":""}]
[null,"Nombre d'expéditions par année ","Veuillez indiquer le nombre d'expéditions requises pour une année, en lien avec la quantité annuelle.\nPour vous aider :\nCalculer le poids total (poids du produit et d'emballage) selon la  quantité annuelle, divisé par la capacité du conteneur choisi. Cela vous permettra de déterminer le nombre de conteneurs requis. Vous pourrez ensuite déterminer combien d'expéditions sont nécessaires en fonction du nombre de conteneurs à expédier dans un voyage.\n "]
[null,"Frais de douane","Veuillez entrer le pourcentage, en fonction du prix unitaire, de la valeur correspondant aux frais de douane pour l'importation de votre produit.\n\nNote  : Vous pouvez vous fier à votre classement tarifaire.\n\n Voici un lien permettant de le trouver :\n\n\n",null,{"$f":"IF($D$10=\"Dollars Américains\",$F$10*$E$10*D17,IF($D$10=\"Devise du pays d'importation\",$F$10*$F$9*D17,\"\"))","v":""}]
[null,"Frais LMSI","Veuillez saisir le pourcentage, en fonction du prix unitaire, de la valeur correspondant aux frais LMSI  (Loi sur les mesures spéciales d'importation) pour l'importation de votre produit.\n\nNote : Vous pouvez vous fier à votre classement tarifaire.\n\n Voici un lien permettant de le trouver :\n\n\n\n"]
[null,"Durée du transit","Veuillez indiquer le type de période d'achalandage de l'année : basse, médiane, maximale. \nLa valeur choisie est considérée dans le calcul de la durée du transit.\nL'hypothèse de la destination finale est Montréal.\n",null,{"$f":"IFERROR(INDEX('Tables de données (WEB)'!D30:F46,MATCH(Calculateur!D9,'Tables de données (WEB)'!C30:C46,0),MATCH(Calculateur!D19,'Tables de données (WEB)'!D29:F29,0)),\"\")","v":""}]
[null,"Terme du paiement","Veuillez entrer la durée en nombre de mois.\nCeci représente le délai entre la date d'expédition et la date de paiement.\n"]
[null,"Taux d'intérêt sur le stockage","Il s'agit du taux d'intérêt annuel, appliqué sur le coût total de stockage de la marchandise qui doit être entreposée dans les infrastructures du port.\n"]
[null,"Coût de possession des stocks (incluant intérêts)","Le coût de possesion des stocks est un standard déterminé par un pourcentage du prix unitaire. \nVeuillez indiquer le pourcentage correspondant à votre situation.\n",null,{"$f":"IF($D$10=\"Dollars Américains\",$F$10*$E$10*D22,IF($D$10=\"Devise du pays d'importation\",$F$10*$F$9*D22,\"\"))","v":""}]
[null,"Coût de manutention du débarquement à l'entrepôt","Veuillez indiquer le nombre d'employés requis pour la manutention de vos marchandises.\nCela représente les coûts de manutention lors du débarquement de la marchandise importée au port, jusqu'à l'arrivée à l'entrepôt/usine.\nLe calcul utilise le taux horaire moyen d'un conducteur de chariot élévateur (18$/h), multiplié par le nombre total d'employés/heure.\n",null,{"$f":"IF(ISBLANK(D23)=TRUE,\"\",D23*18)","v":""}]
[null,"Coût d'emballage","Veuillez indiquer le pourcentage, en fonction du prix unitaire, de la valeur correspondante aux coûts d'emballage additionnels requis pour l'importation. \n",null,{"$f":"IF($D$10=\"Dollars Américains\",$F$10*$E$10*D24,IF($D$10=\"Devise du pays d'importation\",$F$10*$F$9*D24,\"\"))","v":""}]
[null," Coût de retravail, de qualité, de garantie","Veuillez indiquer le pourcentage, en fonction du prix unitaire, de la valeur correspondant aux retours, à la non-conformité, aux coûts de qualité, etc.\n",null,{"$f":"IF($D$10=\"Dollars Américains\",$F$10*$E$10*D25,IF($D$10=\"Devise du pays d'importation\",$F$10*$F$9*D25,\"\"))","v":""}]
[null,"Délai d'approvisionnement","Veuillez entrer le délai d'approvisionnement, en nombre de mois.\nLe délai correspond au laps de temps entre la confirmation de la commande et sa réception en entrepôt/usine.\nCela a un impact sur votre stock de sécurité.\n"]
[null,"Variabilité du taux change","Veuillez saisir le nombre de mois entre le moment où le contrat à été signé et le  paiement.\n"]
[null,"Coût unitaire production locale","IMPORTANT\nVeuillez saisir le coût unitaire du produit, si celui-ci était fabriqué localement. Incluez tous les frais.\n"]
[null,"Coût des voyages pour auditer le fournisseur\n (si applicable)","Veuillez saisir le coût total annuel assumé pour les audits du fournisseur. \nIncluez les frais de déplacement, d'hébergement, et tous les autres frais.\n"]
[null,"Coût transport terrestre\n (si applicable)","Veuillez inscrire le coût représentant les frais de transport terrestre, du port d'arrivée jusqu'à l'entrepôt/usine.\n"]
[null,"Poids de l'emballage\n (si applicable)","Veuillez inscrire le poids de l'emballage (en kg) ajouté pour  l'importation de votre produit.\n"]
[null,"Coût de transport en urgence (aérien)\n(si applicable)","Veuillez inscrire la valeur, en pourcentage du coût unitaire, des frais de transport en urgence liés aux problèmes de qualité ou aux délais d'approvisionnement.\n",null,{"$f":"IF($D$10=\"Dollars Américains\",$F$10*$E$10*D32,IF($D$10=\"Devise du pays d'importation\",$F$10*$F$9*D32,\"\"))","v":""}]
[null,"Coût opportunités manquées\n (si applicable)","Veuillez inscrire la valeur, en pourcentage du coût unitaire, des opportunités manquées liées aux problèmes de qualité ou aux délais d'approvisionnement.\n\nExemple de formule pour le  calcul :\nCoût d'opportunité = OA (retours sur la meilleure option abandonnée) - OC (retours sur l'option choisie)\n",null,{"$f":"IF($D$10=\"Dollars Américains\",$F$10*$E$10*D33,IF($D$10=\"Devise du pays d'importation\",$F$10*$F$9*D33,\"\"))","v":""}]
[null,"Fiabilité du fournisseur\n (si applicable)","Veuillez indiquer une cote correspondant au niveau de confiance accordé à votre fournisseur. Cette cote se transforme en un pourcentage du coût unitaire qui s’ajoute au coût total. \n\nVoici la liste des différents critères. Veuillez attribuer la cote 1 si le fournisseur respecte le critère et 0 s’il ne le respecte pas. Additionnez ensuite chacune des réponses. \n\n- Le respect des délais ;\n- La qualité des produits ;\n- Le rapport qualité-prix des biens échangés ;\n- L'éthique et la réputation du fournisseur ;\n- La santé financière de l'entreprise ;\n- La certification et le respect de certaines normes si le secteur l'exige.\n\nPour plus d'information : \n\n\n\n\n\n\n\n\n\n\n\n\n",null,{"$f":"IF(ISBLANK(D34)=TRUE,\"\",VLOOKUP(Calculateur!D34,'Tables de données (WEB)'!J31:K36,2,FALSE))","v":""}]
[null,"Instabilité du pays fournisseur (si applicable)","Veillez indiquer le continent ou secteur correspondant au pays d'importation. \nUn coût supplémentaire, en pourcentage du coût unitaire, est associé aux facteurs de risque liés au pays du fournisseur.\n\nChaque niveau de risque est associé à une augmentation de 0.025% du prix unitaire.\n\nPour plus d'information :",null,{"$f":"IFERROR(INDEX('Tables de données (WEB)'!Q30:V42,MATCH(Calculateur!F12,'Tables de données (WEB)'!P30:P42,0),MATCH(Calculateur!D35,'Tables de données (WEB)'!Q29:V29,0)),\"\")","v":""}]
[null,"Salaire des auditeurs\nincluant bénéfices\n (si applicable)","Veuillez inscrire les coûts associés au salaire des auditeurs des fournisseurs.\n"]
[null,"Coûts de prototypage\n (si applicable)","Veuillez indiquer le pourcentage, en fonction du prix unitaire, de la valeur correspondante aux frais de prototypage ou de propriété intellectuelle.",null,{"$f":"IF($D$10=\"Dollars Américains\",$F$10*$E$10*D37,IF($D$10=\"Devise du pays d'importation\",$F$10*$F$9*D37,\"\"))","v":""}]
[null,null,null,null,{"$f":"IF(ISBLANK(D14)=TRUE,\"\",IF(D14=\"20 Pieds\",VLOOKUP(D9,'Tables de données (WEB)'!J6:M23,3,FALSE),VLOOKUP(D9,'Tables de données (WEB)'!J6:M23,4,FALSE)))","v":""}]

{"sheet":"Résultats","index":2,"n_rows":27,"n_cols":7,"rows_kept":27,"cut":false,"hidden":false,"merged":[[26,2,26,3],[25,2,25,3],[24,5,24,7],[23,2,23,3],[22,5,22,7],[23,5,23,7],[24,2,24,3],[21,2,21,8],[22,2,22,3],[1,1,1,18],[18,3,18,4],[19,3,19,4],[20,3,20,4],[3,1,3,18],[5,2,5,4],[5,6,5,8]]}
[]
[null,"Coût total d'importation au Québec"]
[]
[null,"Résultats (Coûts d'importation et coûts de production)"]
[]
[null,null,"Détail des coûts d'importations",null,null,null,"Détail des coûts locaux"]
[null,null,"Coût total d'importation",null,null,null,"Coût total de production locale"]
[]
[]
[null,null,"Coût unitaire d'importation",null,null,null,"Coût unitaire de production locale"]
[]
[]
[]
[]
[]
[]
[]
[]
[]
[]
[]
[null,null,"Détail des coûts par variable"]
[null,null,"Emballage",null,null,"Stock en transit"]
[null,null,"Frais de fret",null,null,"Coût de possession des stocks"]
[null,null,"Frais de transport",null,null,"Qualité"]
[null,null,"Assurances (FOB)",null,null,"Stock de sécurité"]
[null,null,"Douanes/Courtage\n",null,null,"Coût d'achat"]

{"sheet":"Tables de données (WEB)","index":3,"n_rows":117,"n_cols":22,"rows_kept":117,"cut":false,"hidden":true,"merged":[[48,1,48,22],[4,2,4,4],[4,9,4,12],[3,2,3,4],[3,9,3,12],[27,2,28,2],[24,9,24,10],[27,9,27,10],[28,9,28,10],[26,15,26,21],[3,15,3,18],[4,15,4,18],[27,15,27,21],[25,2,25,5],[26,2,26,5],[1,1,1,22],[23,9,23,10]]}
[]
[null,"Données converties"]
[]
[null,null,"Tableau des Taux de Change du Dollar Canadien\nCanadian Dollar Exchange Rates Table",null,null,null,null,null,null,"Tarifs moyens de transport et de fret\nAverage Freight rates",null,null,null,null,null,"\nTaux d'inflation au Canada\n(*) Taux d'inflation projété\n"]
[null,null,"Source:\nhttps://www.x-rates.com/table/?from=CAD&amount=1",null,null,null,null,null,null,"Source:\nhttps://moverdb.com/freight-costs-canada/\n\nhttp://www.bv.transports.gouv.qc.ca/mono/1142367.pdf\nsection 4.3",null,null,null,null,null,"Source:\nhttps://www.statista.com/statistics/271247/inflation-rate-in-canada/"]
[null,null,"Pays","Device","1.00 CAD▲▼",null,null,null,null,"Destination Country (Port City)","Pays par association","20 Pieds","40 Pieds",null,null,"Année","Inflation Rate","Coût d'importation","Coût local"]
[null,null,"Brésil","Brazilian Real",{"$f":"VLOOKUP(D7:D23,Table_1[],3,FALSE)","v":"0.276733"},null,null,null,null,"Brésil",{"$f":"F74","v":"Haiti (Port-au-Prince)"},{"$f":"VLOOKUP(K7:K23,Cost_from_Eastern_Canada__Montreal[],2,FALSE)/1000","v":1.3089999999999999},{"$f":"VLOOKUP(K7:K23,Cost_from_Eastern_Canada__Montreal[],3,FALSE)/1000","v":1.607},null,null,2021,{"$f":"J57","v":"3.9%"},{"$f":"Résultats!$C$8","v":0},{"$f":"Résultats!$G$8","v":0}]
[null,null,"Chine","Chinese Yuan Renminbi","0.189557",null,null,null,null,"Chine",{"$f":"F62","v":"China (Shanghai)"},7.01,8.5960000000000001,null,null,2022,{"$f":"J56","v":"2.39%"},{"$f":"Résultats!$C$8*(1+Q8)","v":0},{"$f":"Résultats!$G$8*(1+Q8)","v":0}]
[null,null,"France","Euro","1.462807",null,null,null,null,"France",{"$f":"F72","v":"France (Marseilles)"},4.1349999999999998,6.3579999999999997,null,null,2023,{"$f":"J55","v":"1.88%"},{"$f":"Résultats!$C$8*(1+Q9)","v":0},{"$f":"Résultats!$G$8*(1+Q9)","v":0}]
[null,null,"Allemagne","Euro","1.462807",null,null,null,null,"Allemagne",{"$f":"F73","v":"Germany (Hamburg)"},1.6970000000000001,2.0920000000000001,null,null,2024,{"$f":"J54","v":"1.88%"},{"$f":"Résultats!$C$8*(1+Q10)","v":0},{"$f":"Résultats!$G$8*(1+Q10)","v":0}]
[null,null,"Hong Kong","Hong Kong Dollar","0.177280",null,null,null,null,"Hong Kong",{"$f":"F75","v":"Hong Kong (Hong Kong)"},1.732,2.0459999999999998,null,null,2025,{"$f":"J53","v":"1.9%"},{"$f":"Résultats!$C$8*(1+Q11)","v":0},{"$f":"Résultats!$G$8*(1+Q11)","v":0}]
[null,null,"Inde","Indian Rupee","0.016658",null,null,null,null,"Inde",{"$f":"F76","v":"India (Mumbai)"},2.915,3.371,null,null,2026,{"$f":"J52","v":"1.97%"},{"$f":"Résultats!$C$8*(1+Q12)","v":0},{"$f":"Résultats!$G$8*(1+Q12)","v":0}]
[null,null,"Indonésie","Indonesian Rupiah","0.000087",null,null,null,null,"Indonésie",{"$f":"F102","v":"Singapore (Singapore)"},3.9049999999999998,5.3129999999999997]
[null,null,"Italie","Euro","1.462807",null,null,null,null,"Italie",{"$f":"F72","v":"France (Marseilles)"},4.1349999999999998,6.3579999999999997]
[null,null,"Japon","Japanese Yen","0.009181",null,null,null,null,"Japon",{"$f":"F81","v":"Japan (Tokyo)"},11.622,17.286999999999999]
[null,null,"Mexique","Mexican Peso","0.077302",null,null,null,null,"Mexique",{"$f":"F90","v":"Mexico (Manzanillo)"},1.5489999999999999,2.2749999999999999]
[null,null,"Pays-Bas","Euro","1.462807",null,null,null,null,"Pays-Bas",{"$f":"F92","v":"Netherlands (Rotterdam)"},1.516,2.8109999999999999]
[null,null,"Pakistan","Pakistani Rupee","0.004932",null,null,null,null,"Pakistan",{"$f":"F99","v":"Qatar (Doha)"},2.94,3.6859999999999999]
[null,null,"Portugal","Euro","1.462807",null,null,null,null,"Portugal",{"$f":"F98","v":"Portugal (Lisbon)"},4.218,6.1219999999999999]
[null,null,"Corée du Sud","South Korean Won","0.001025",null,null,null,null,"Corée du Sud",{"$f":"F105","v":"South Korea (Busan)"},10.433999999999999,5.2080000000000002]
[null,null,"Espagne","Euro","1.462807",null,null,null,null,"Espagne",{"$f":"F106","v":"Spain (Valencia)"},1.7110000000000001,2.0049999999999999]
[null,null,"Taïwan","Taiwan New Dollar","0.042758",null,null,null,null,"Taïwan",{"$f":"F75","v":"Hong Kong (Hong Kong)"},1.732,2.0459999999999998]
[null,null,"Royaume-Uni","British Pound","1.683959",null,null,null,null,"Royaume-Uni",{"$f":"F112","v":"UK (London)"},2.3860000000000001,2.9590000000000001]
[null,null,"Dollars Américains","US Dollar",{"$f":"VLOOKUP(D24,Table_1[],3,FALSE)+0.00001","v":1.387086},null,null,null,null,"Prix",null,"20 Pieds","40 Pieds"]
[null,null,null,null,null,null,null,null,null,"Total",null,303,404]
[null,null,"Durée du transit"]
[null,null,"(Dernière mise à jour en date du 11 Mai 2021)\nSource: \nhttps://www.searates.com/fr/services/distances-time/",null,null,null,null,null,null,null,null,null,null,null,null,"Instabilité du pays"]
[null,null,"Pays de provenance","Nombre de jours (Basse, -10%)","Nombre de jours (Médian)","Nombre de jours (Sommet, +10%)",null,null,null,"Instabilité du fournisseur",null,null,null,"Catégorie de produit",null,"Source:\nhttps://www.coface.fr/Etudes-economiques-et-risque-pays"]
[null,null,null,"Basse","Médiane","Maximale",null,null,null,"Source:\nhttps://fiches-pratiques.chefdentreprise.com/Thematique/achats-1106/FichePratique/Comment-mesurer-fiabilite-ses-fournisseurs-257175.htm#:~:text=Le%20plus%20simple%20pour%20s,comparer%20aux%20exigences%20des%20certifications",null,null,null,"Source:\nhttps://www.reshorenow.org/tco-estimator/",null,"Secteur / Continent","Asie-Pacifique","Europe centrale et de l'est","Amérique Latine","Moy-Orient & Turquie","Amérique du Nord","Europe de l'Ouest"]
[null,null,"Brésil",{"$f":"ROUNDUP(E30*0.9,0)","v":20},22,{"$f":"ROUNDUP(E30*1.1,0)","v":25},null,null,null,"Cote","%",null,null,"Agroalimentaire",null,"Agroalimentaire",2.5000000000000001E-3,2.5000000000000001E-3,5.0000000000000001E-3,5.0000000000000001E-3,5.0000000000000001E-3,2.5000000000000001E-3]
[null,null,"Chine",{"$f":"ROUNDUP(E31*0.9,0)","v":37},41,{"$f":"ROUNDUP(E31*1.1,0)","v":46},null,null,null,1,2.5000000000000001E-2,null,null,"Automobile",null,"Automobile",2.5000000000000001E-3,2.5000000000000001E-3,5.0000000000000001E-3,5.0000000000000001E-3,5.0000000000000001E-3,5.0000000000000001E-3]
[null,null,"France",10,11,13,null,null,null,2,0.02,null,null,"Bois",null,"Bois",5.0000000000000001E-3,5.0000000000000001E-3,5.0000000000000001E-3,5.0000000000000001E-3,2.5000000000000001E-3,5.0000000000000001E-3]
[null,null,"Allemagne",10,11,13,null,null,null,3,1.4999999999999999E-2,null,null,"Chimie",null,"Chimie",2.5000000000000001E-3,2.5000000000000001E-3,5.0000000000000001E-3,5.0000000000000001E-3,5.0000000000000001E-3,2.5000000000000001E-3]
[null,null,"Hong Kong",37,41,46,null,null,null,4,0.01,null,null,"Construction",null,"Construction",7.4999999999999997E-3,5.0000000000000001E-3,5.0000000000000001E-3,7.4999999999999997E-3,2.5000000000000001E-3,5.0000000000000001E-3]
[null,null,"Inde",25,27,30,null,null,null,5,5.0000000000000001E-3,null,null,"Distribution",null,"Distribution",5.0000000000000001E-3,5.0000000000000001E-3,5.0000000000000001E-3,5.0000000000000001E-3,7.4999999999999997E-3,5.0000000000000001E-3]
[null,null,"Indonésie",39,43,48,null,null,null,6,0,null,null,"Énergie",null,"Énergie",5.0000000000000001E-3,2.5000000000000001E-3,5.0000000000000001E-3,5.0000000000000001E-3,7.4999999999999997E-3,5.0000000000000001E-3]
[null,null,"Italie",12,13,15,null,null,null,null,null,null,null,"Métallurgie",null,"Métallurgie",5.0000000000000001E-3,5.0000000000000001E-3,5.0000000000000001E-3,7.4999999999999997E-3,5.0000000000000001E-3,7.4999999999999997E-3]
[null,null,"Japon",33,36,40,null,null,null,null,null,null,null,"Papier",null,"Papier",2.5000000000000001E-3,2.5000000000000001E-3,5.0000000000000001E-3,5.0000000000000001E-3,5.0000000000000001E-3,5.0000000000000001E-3]
[null,null,"Mexique",16,17,19,null,null,null,null,null,null,null,"Pharmacie",null,"Pharmacie",0,0,2.5000000000000001E-3,2.5000000000000001E-3,2.5000000000000001E-3,2.5000000000000001E-3]
[null,null,"Pays-Bas",10,11,13,null,null,null,null,null,null,null,"Textile-Habillement",null,"Textile-Habillement",5.0000000000000001E-3,5.0000000000000001E-3,7.4999999999999997E-3,5.0000000000000001E-3,7.4999999999999997E-3,7.4999999999999997E-3]
[null,null,"Pakistan",27,29,32,null,null,null,null,null,null,null,"TIC",null,"TIC",2.5000000000000001E-3,2.5000000000000001E-3,5.0000000000000001E-3,5.0000000000000001E-3,2.5000000000000001E-3,2.5000000000000001E-3]
[null,null,"Portugal",9,10,11,null,null,null,null,null,null,null,"Transports",null,"Transports",5.0000000000000001E-3,7.4999999999999997E-3,5.0000000000000001E-3,5.0000000000000001E-3,5.0000000000000001E-3,5.0000000000000001E-3]
[null,null,"Corée du Sud",36,39,43]
[null,null,"Espagne",10,11,13]
[null,null,"Taïwan",36,40,44]
[null,null,"Royaume-Uni",9,10,11]
[]
[]
[null,"Données référentielles"]
[]
[null,null,"Canadian Dollar▲","1.00 CAD▲▼","inv. 1.00 CAD▲▼","Destination Country (Port/City)","20FT","40FT","Characteristic","Inflation rate"]
[null,null,"Argentine Peso","252.329835","0.003963","Andorra (Andorra la Vella)",6882,8413,"2028*","1.97%"]
[null,null,"Australian Dollar","1.130647","0.884449","Argentina (Buenos Aires)",8659,9200,"2027*","1.9%"]
[null,null,"Bahraini Dinar","0.271074","3.689031","Australia (Sydney)",3105,4544,"2026*","1.88%"]
[null,null,"Botswana Pula","9.837373","0.101653","Austria (Vienna)",4129,6218,"2025*","1.88%"]
[null,null,"Brazilian Real","3.613589","0.276733","Belize (Belize City)",3558,4145,"2024*","2.39%"]
[null,null,"British Pound","0.593839","1.683959","Brazil (Santos)",9097,8532,"2023*","3.9%"]
[null,null,"Bruneian Dollar","0.987579","1.012577","British Virgin Islands (Road Town)",1903,2468,"2022","6.8%"]
[null,null,"Bulgarian Lev","1.337039","0.747921","Cambodia (Sihanoukville)",6384,7627,"2021","3.4%"]
[null,null,"Chilean Peso","646.040944","0.001548","Chile (San Antonio)",3768,3817,"2020","0.72%"]
[null,null,"Chinese Yuan Renminbi","5.275460","0.189557","China (Beijing)",6390,8414,"2019","1.95%"]
[null,null,"Colombian Peso","2969.918945","0.000337","China (Shanghai)",7010,8596,"2018","2.27%"]
[null,null,"Czech Koruna","16.875390","0.059258","Colombia (Barranquilla)",1630,1956,"2017","1.6%"]
[null,null,"Danish Krone","5.102751","0.195973","Costa Rica (Limon)",1364,1743,"2016","1.43%"]
[null,null,"Emirati Dirham","2.647657","0.377692","Croatia (Rijeka)",1896,1894,"2015","1.13%"]
[null,null,"Euro","0.683617","1.462807","Cyprus (Limassol)",1793,2636,"2014","1.91%"]
[null,null,"Hong Kong Dollar","5.640781","0.177280","Czech Republic (Prague)",4129,6412,"2013","0.94%"]
[null,null,"Hungarian Forint","262.262519","0.003813","Denmark (Copenhagen)",2359,2907,"2012","1.52%"]
[null,null,"Icelandic Krona","100.969678","0.009904","Egypt (Alexandria)",2461,2768,"2011","2.91%"]
[null,null,"Indian Rupee","60.030119","0.016658","Estonia (Tallinn)",1922,2215,"2010","1.78%"]
[null,null,"Indonesian Rupiah","11491.574379","0.000087","Finland (Helsinki)",1922,2215,"2009","0.3%"]
[null,null,"Iranian Rial","30458.433569","0.000033","France (Marseilles)",4135,6358,"2008","2.37%"]
[null,null,"Israeli Shekel","2.893590","0.345591","Germany (Hamburg)",1697,2092,"2007","2.14%"]
[null,null,"Japanese Yen","108.917397","0.009181","Haiti (Port-au-Prince)",1309,1607,"2006","2.02%"]
[null,null,"Kazakhstani Tenge","338.522446","0.002954","Hong Kong (Hong Kong)",1732,2046,"2005","2.21%"]
[null,null,"Kuwaiti Dinar","0.222983","4.484656","India (Mumbai)",2915,3371,"2004","1.86%"]
[null,null,"Libyan Dinar","3.522926","0.283855","Indonesia (Jakarta)",7651,9258,"2003","2.76%"]
[null,null,"Malaysian Ringgit","3.439573","0.290734","Ireland (Dublin)",2356,2959,"2002","2.26%"]
[null,null,"Mauritian Rupee","31.876011","0.031372","Israel (Haifa)",1793,2404,"2001","2.53%"]
[null,null,"Mexican Peso","12.936223","0.077302","Italy (Trieste)",1896,2282,"2000","2.72%"]
{"$rows_left_out":38}
{"sheet":"Historique des calculs","index":4,"n_rows":1,"n_cols":35,"rows_kept":1,"cut":false,"hidden":false,"merged":[]}
["Horodatage","Nom de l'entreprise","Coût total d'importation","Coût unitaire d'importation","Coût total de production locale","Coût unitaire de production locale","Pays","Prix unitaire","Quantité annuelle","Catégorie de produits","Poids du produit ","Frais de transport","Frais de fret ","Nombre d'expéditions par année ","Frais de douane","Frais LMSI","Durée du transit","Terme de paiement","Taux d'intérêt de stockage","Coût de possession des stocks (plus interêts)","Coût de manutention du débarquement à l'entrepôt","Coût d'emballage"," Coût de retravail, de qualité, de garantie","Délai d'approvisionnement","Variabilité du taux change","Coût unitaire local","Coût des voyages pour auditer le fournisseur \n(si appliquable)","Pourcentage de transport terrestre\n (si appliquable)","Poids de l'emballage\n (si appliquable)","Transport urgent (aérien) dû problème de qualité ou délai en quantité de produit\n (si appliquable)","Coût opportunité manqué dû problème de qualité ou délai \n(si appliquable)","Fiabilité du fournisseur\n (si appliquable)","Instabilité du pays fournisseur\n (si appliquable)","Coût de salaire incluant bénéfices des auditeurs \n (si appliquable)","Coûts de prototypage  (si appliquable)"]